Target
Histone deacetylase 1
Ligand
BDBM213181
Substrate
Meas. Tech.
HDAC Enzyme Assay
pH
7.4±n/a
Temperature
298.15±n/a K
IC50
10±n/a nM
Comments
extracted
Citation
 van Duzer, JHMazitschek, RJones, SSYang, MTamang, DL Pyrimidine hydroxy amide compounds as histone deacetylase inhibitors US Patent  US9278963 Publication Date 3/8/2016 
Target
Name:
Histone deacetylase 1
Synonyms:
Cereblon/Histone deacetylase 1 HDAC1 Histone deacetylase 1 (HDAC1) RPD3L1
Type:
Enzyme
Mol. Mass.:
55090.27
Organism:
Homo sapiens (Human)
Description:
Q13547
Residue:
482
  
Inhibitor
Name:
BDBM213181
Synonyms:
US9278963, 031
Type:
Small organic molecule
Emp. Form.:
C26H26N6O3
Mol. Mass.:
470.523
SMILES:
ONC(=O)c1cnc(NC2(CCN(CC2)C(=O)Cc2cc3ccccc3[nH]2)c2ccccc2)nc1
: