Target
Sodium/glucose cotransporter 1
Ligand
BDBM213821
Substrate
Meas. Tech.
Sodium-Dependent Glucose Transporter (SGLT) Assay
pH
7.5±n/a
Temperature
310.15±n/a K
IC50
26±20 nM
Comments
extracted
Citation
 Qu, F Pyrazole compounds US Patent  US9296775 Publication Date 3/29/2016 
Target
Name:
Sodium/glucose cotransporter 1
Synonyms:
High affinity sodium-glucose cotransporter Na(+)/glucose cotransporter 1 SGLT1 Sodium-dependent glucose cotransporter 1 (SGLT1) Sodium/glucose cotransporter 1 (SGLT1) | Solute carrier family 5 member 1
Type:
Protein
Mol. Mass.:
73503.78
Organism:
Homo sapiens (Human)
Description:
P13866
Residue:
664
  
Inhibitor
Name:
BDBM213821
Synonyms:
US9296775, 1
Type:
Small organic molecule
Emp. Form.:
C33H50N4O6
Mol. Mass.:
598.7733
SMILES:
CC(C)c1[nH]nc(O[C@@H]2O[C@H](CO)[C@@H](O)[C@H](O)[C@H]2O)c1Cc1ccc(\C=C\CCN2CCCC3(CCNCC3)C2)cc1C
: