Target
Glutamate receptor ionotropic, NMDA 2B
Ligand
BDBM213888
Substrate
Meas. Tech.
Two-electrode Voltage Clamp Electrophysiology
pH
7.4±n/a
Temperature
298.15±n/a K
IC50
40± 2e+3 nM
Comments
extracted
Citation
 Kvist, TSteffensen, TBGreenwood, JRMehrzad Tabrizi, FHansen, KBGajhede, MPickering, DSTraynelis, SFKastrup, JSBräuner-Osborne, H Crystal structure and pharmacological characterization of a novel N-methyl-D-aspartate (NMDA) receptor antagonist at the GluN1 glycine binding site. J Biol Chem 288:33124-35 (2013)  
Target
Name:
Glutamate receptor ionotropic, NMDA 2B
Synonyms:
GluN1/N2B
Type:
Receptor
Mol. Mass.:
Description:
Components:
This complex has 2 components.
Component 1
Name:
Glutamate receptor
Synonyms:
NMDA receptor subunit GluN1-1a (GluN1)
Type:
Protein
Mol. Mass.:
105593.49
Organism:
Rattus norvegicus (Rat)
Description:
Q62683
Residue:
938
  
Component 2
Name:
Glutamate receptor ionotropic, NMDA 2B
Synonyms:
GluN2B Grin2b NMDA receptor subunit N2B (GluN2B) NMDE2_RAT | NR2B
Type:
Protein
Mol. Mass.:
166077.66
Organism:
Rattus norvegicus (Rat)
Description:
Q00960
Residue:
1482
  
Inhibitor
Name:
BDBM213888
Synonyms:
1-thioxo-1,2-dihydro-[1,2,4]triazolo[4,3-a]-quinoxalin-4(5H)-one | TK40
Type:
Small organic molecule
Emp. Form.:
C9H6N4OS
Mol. Mass.:
218.235
SMILES:
Sc1nnc2n1c1ccccc1[nH]c2=O
: