Target
Cannabinoid receptor 1 [R340A]
Ligand
BDBM50072775
Substrate
Meas. Tech.
Radioligand Binding Assay
pH
7.4±n/a
Kd
1.6±0.3 nM
Comments
extracted
Citation
 Shim, JYAhn, KHKendall, DA Molecular basis of cannabinoid CB1 receptor coupling to the G protein heterotrimer Gaiß¿: identification of key CB1 contacts with the C-terminal helix a5 of Gai. J Biol Chem 288:32449-65 (2013)  
Target
Name:
Cannabinoid receptor 1 [R340A]
Synonyms:
CNR CNR1_HUMAN | Cannabinoid receptor 1 (CB1 R340A)
Type:
Protein
Mol. Mass.:
52782.85
Organism:
Homo sapiens (Human)
Description:
Human CB1 R340A mutant
Residue:
472
  
Inhibitor
Name:
BDBM50072775
Synonyms:
2-((1R,2R,5R)-5-hydroxy-2-(3-hydroxypropyl)cyclohexyl)-5-(2-methyloctan-2-yl)phenol 5-(1,1-Dimethyl-heptyl)-2-[(4R,6R)-5-hydroxy-2-((R)-3-hydroxy-propyl)-cyclohexyl]-phenol CP-55940 CP55,940 ChEMBL_75020
Type:
Small organic molecule
Emp. Form.:
C24H40O3
Mol. Mass.:
376.5726
SMILES:
CCCCCCC(C)(C)c1ccc([C@@H]2C[C@H](O)CC[C@H]2CCCO)c(O)c1
: