Target
Tyrosine-protein kinase BTK
Ligand
BDBM290140
Substrate
Meas. Tech.
Caliper-based kinase assay
Temperature
298.15±n/a K
IC50
1.80±n/a nM
Comments
extracted
Citation
 Babler, MGerritsen, ME Treatment of dry eye US Patent  US9572811 Publication Date 2/21/2017 
Target
Name:
Tyrosine-protein kinase BTK
Synonyms:
AGMX1 Agammaglobulinaemia tyrosine kinase B cell progenitor kinase BPK BTK_HUMAN Tyrosine Kinase BTK Tyrosine-protein kinase BTK (BTK)
Type:
Enzyme
Mol. Mass.:
76289.95
Organism:
Homo sapiens (Human)
Description:
Q06187
Residue:
659
  
Inhibitor
Name:
BDBM290140
Synonyms:
US9572811, Example 22A | US9572811, Example 22B
Type:
Small organic molecule
Emp. Form.:
C29H26FN7O2
Mol. Mass.:
523.5608
SMILES:
Nc1ncnc2n(nc(-c3ccc(Oc4ccccc4)cc3F)c12)[C@@H]1CCCN(C1)C(=O)C(=CC1CC1)[N+]#[C-]
: