Target
Tyrosine-protein kinase BTK
Ligand
BDBM290228
Substrate
Meas. Tech.
Caliper-based kinase assay
Temperature
298.15±n/a K
IC50
2.70±n/a nM
Comments
extracted
Citation
 Babler, MGerritsen, ME Treatment of dry eye US Patent  US9572811 Publication Date 2/21/2017 
Target
Name:
Tyrosine-protein kinase BTK
Synonyms:
AGMX1 Agammaglobulinaemia tyrosine kinase B cell progenitor kinase BPK BTK_HUMAN Tyrosine Kinase BTK Tyrosine-protein kinase BTK (BTK)
Type:
Enzyme
Mol. Mass.:
76289.95
Organism:
Homo sapiens (Human)
Description:
Q06187
Residue:
659
  
Inhibitor
Name:
BDBM290228
Synonyms:
(S)-2-(2-((4-amino-6-methyl-5-(4-phenoxyphenyl)-7H-pyrrolo[2,3-d]pyrimidin-7-yl)methyl)pyrrolidine-1-carbonyl)-3-cyclopropylacrylonitrile | US9572811, Example 29
Type:
Small organic molecule
Emp. Form.:
C31H30N6O2
Mol. Mass.:
518.6089
SMILES:
Cc1c(-c2ccc(Oc3ccccc3)cc2)c2c(N)ncnc2n1C[C@@H]1CCCN1C(=O)C(=CC1CC1)C#N
: