Target
Plasminogen [101-181]
Ligand
BDBM290336
Substrate
Meas. Tech.
Biacore Assay
pH
7±n/a
IC50
11.0±n/a nM
Comments
extracted
Citation
 Haßfeld, JKinzel, TKöbberling, JCancho-Grande, YBeyer, KRöhrig, SKöllnberger, MSperzel, MBurkhardt, NSchlemmer, KStegmann, CSchuhmacher, JWerner, MEllermann, M (Aza)pyridopyrazolopyrimidinones and indazolopyrimidinones and their use US Patent  US10098883 Publication Date 10/16/2018 
Target
Name:
Plasminogen [101-181]
Synonyms:
PLG Plasminogen (aa 101-181)
Type:
Enzyme Catalytic Domain
Mol. Mass.:
9281.08
Organism:
Homo sapiens (Human)
Description:
P00747[101-181]
Residue:
81
  
Inhibitor
Name:
BDBM290336
Synonyms:
10-Chloro-8-methyl-4-(piperidin-4-yl)pyrimido[1,2-b]indazol-2(1H)-one hydrochloride US10668071, Example 79
Type:
Small organic molecule
Emp. Form.:
C16H17ClN4O
Mol. Mass.:
316.785
SMILES:
Cc1cc(Cl)c2c(c1)nn1c(cc(=O)[nH]c21)C1CCNCC1
: