Target
Histone H3.1 [22-45]
Ligand
BDBM155253
Substrate
Meas. Tech.
Wild-Type and Mutant PRC2 Enzyme Assays
IC50
<5±0 nM
Citation
 Kuntz, KWCampbell, JESeki, M Substituted benzene compounds US Patent  US10098888 Publication Date 10/16/2018 
Target
Name:
Histone H3.1 [22-45]
Synonyms:
H31_HUMAN H3FA H3FC HIST1H3C H3FF H3FI H3FK H3K27me2 HIST1H3B HIST1H3E HIST1H3G HIST1H3I | HIST1H3J
Type:
Enzyme Catalytic Domain
Mol. Mass.:
2699.67
Organism:
Homo sapiens (Human)
Description:
P68431[22-45]
Residue:
26
  
Inhibitor
Name:
BDBM155253
Synonyms:
US10098888, Compound 1 | US9006242, 1
Type:
Small organic molecule
Emp. Form.:
C35H48N4O4
Mol. Mass.:
588.78
SMILES:
CCN([C@H]1CC[C@@H](CC1)N(C)C)c1cc(cc(C(=O)NCc2c(C)cc(C)[nH]c2=O)c1C)-c1ccc(OCCOC)cc1
: