Target
Cytochrome P450 2C8
Ligand
BDBM155255
Substrate
Meas. Tech.
Assessment of CYP Inhibition
IC50
47.43±0.0 nM
Citation
 Kuntz, KWCampbell, JESeki, M Substituted benzene compounds US Patent  US10098888 Publication Date 10/16/2018 
Target
Name:
Cytochrome P450 2C8
Synonyms:
CP2C8_HUMAN CYPIIC8 P450 IIC2 P450 form 1 | S-mephenytoin 4-hydroxylase
Type:
Protein
Mol. Mass.:
55839.23
Organism:
Homo sapiens (Human)
Description:
P10632
Residue:
490
  
Inhibitor
Name:
BDBM155255
Synonyms:
US10098888, Compound 105 US9006242, 105
Type:
Small organic molecule
Emp. Form.:
C31H42N4O3
Mol. Mass.:
518.6902
SMILES:
CCN(C1CCOCC1)c1cc(cc(C(=O)NCc2c(C)cc(C)[nH]c2=O)c1C)C#CC1CCN(C)CC1
: