Target
Tyrosine-protein kinase ITK/TSK
Ligand
BDBM97672
Substrate
Meas. Tech.
In Vitro HotSpot Kinase Assay
IC50
909.9±n/a nM
Citation
 Honigberg, LVerner, EBuggy, JLoury, DChen, W Inhibitors of bruton's tyrosine kinase for the treatment of solid tumors US Patent  US9278100 Publication Date 3/8/2016 
Target
Name:
Tyrosine-protein kinase ITK/TSK
Synonyms:
EMT ITK_HUMAN LYK Tyrosine-protein kinase ITK Tyrosine-protein kinase Lyk
Type:
Protein
Mol. Mass.:
71839.20
Organism:
Homo sapiens (Human)
Description:
Q08881
Residue:
620
  
Inhibitor
Name:
BDBM97672
Synonyms:
US8476284, 40 US9181263, 9 | US9278100, 9
Type:
Small organic molecule
Emp. Form.:
C26H26N6O2
Mol. Mass.:
454.5236
SMILES:
Nc1ncnc2n(nc(-c3ccc(Oc4ccccc4)cc3)c12)[C@@H]1CC[C@@H](CC1)NC(=O)C=C
: