Target
Urease subunit alpha
Ligand
BDBM50099857
Substrate
Meas. Tech.
In Vitro Urease Inhibition Assay
IC50
1.20e+5±n/a nM
Citation
 Abdullah, MAAbuo-Rahma, GEAbdelhafez, EMHassan, HAAbd El-Baky, RM Design, synthesis, molecular docking, anti-Proteus mirabilis and urease inhibition of new fluoroquinolone carboxylic acid derivatives. Bioorg Chem 70:1-11 (2017)  
Target
Name:
Urease subunit alpha
Synonyms:
URE23_HELPY hpuA | ureA
Type:
Enzyme
Mol. Mass.:
26545.30
Organism:
Helicobacter pylori
Description:
P14916
Residue:
238
  
Inhibitor
Name:
BDBM50099857
Synonyms:
ACETOHYDROXAMIC ACID (AHA) Acethydroxamsaeure Acetic acid, oxime Cetohyroxamic acid Methylhydroxamic acid N-Acetylhydroxylamine acetohydroxamic acid
Type:
Small organic molecule
Emp. Form.:
C2H5NO2
Mol. Mass.:
75.0666
SMILES:
CC(=O)NO
: