Target
Urease subunit alpha
Ligand
BDBM221053
Substrate
Meas. Tech.
In Vitro Urease Inhibition Assay
IC50
7.17e+3±n/a nM
Citation
 Abdullah, MAAbuo-Rahma, GEAbdelhafez, EMHassan, HAAbd El-Baky, RM Design, synthesis, molecular docking, anti-Proteus mirabilis and urease inhibition of new fluoroquinolone carboxylic acid derivatives. Bioorg Chem 70:1-11 (2017)  
Target
Name:
Urease subunit alpha
Synonyms:
URE23_HELPY hpuA | ureA
Type:
Enzyme
Mol. Mass.:
26545.30
Organism:
Helicobacter pylori
Description:
P14916
Residue:
238
  
Inhibitor
Name:
BDBM221053
Synonyms:
7-(4-(3,4,5-Trimethoxybenzoylpiperazin-1-yl)-1-cyclopropyl-6-fluoro-1,4-dihydro-N-hydroxy-4-oxoquinoline-3-carboxamide (2c)
Type:
Small organic molecule
Emp. Form.:
C27H29FN4O7
Mol. Mass.:
540.5402
SMILES:
COc1cc(cc(OC)c1OC)C(=O)N1CCN(CC1)c1cc2n(cc(C(=O)NO)c(=O)c2cc1F)C1CC1
: