Target
Urease subunit alpha
Ligand
BDBM221054
Substrate
Meas. Tech.
In Vitro Urease Inhibition Assay
IC50
1.930e+4±n/a nM
Citation
 Abdullah, MAAbuo-Rahma, GEAbdelhafez, EMHassan, HAAbd El-Baky, RM Design, synthesis, molecular docking, anti-Proteus mirabilis and urease inhibition of new fluoroquinolone carboxylic acid derivatives. Bioorg Chem 70:1-11 (2017)  
Target
Name:
Urease subunit alpha
Synonyms:
URE23_HELPY hpuA | ureA
Type:
Enzyme
Mol. Mass.:
26545.30
Organism:
Helicobacter pylori
Description:
P14916
Residue:
238
  
Inhibitor
Name:
BDBM221054
Synonyms:
7-(4-((4-((E)-3-(Phenylacryloyl)phenylcarbamoyl)methyl)piperazin-1-yl)-1-cyclopropyl-6-fluoro-1,4-dihydro-N-hydroxy-4-oxoquinoline-3-carboxamide (2d)
Type:
Small organic molecule
Emp. Form.:
C34H32FN5O5
Mol. Mass.:
609.6468
SMILES:
ONC(=O)c1cn(C2CC2)c2cc(N3CCN(CC(=O)Nc4ccc(cc4)C(=O)\C=C\c4ccccc4)CC3)c(F)cc2c1=O
: