Target
Urease subunit alpha
Ligand
BDBM221056
Substrate
Meas. Tech.
In Vitro Urease Inhibition Assay
IC50
1.29e+3±n/a nM
Citation
 Abdullah, MAAbuo-Rahma, GEAbdelhafez, EMHassan, HAAbd El-Baky, RM Design, synthesis, molecular docking, anti-Proteus mirabilis and urease inhibition of new fluoroquinolone carboxylic acid derivatives. Bioorg Chem 70:1-11 (2017)  
Target
Name:
Urease subunit alpha
Synonyms:
URE23_HELPY hpuA | ureA
Type:
Enzyme
Mol. Mass.:
26545.30
Organism:
Helicobacter pylori
Description:
P14916
Residue:
238
  
Inhibitor
Name:
BDBM221056
Synonyms:
7-(4-Acetylpiperazin-1-yl)-1-cyclopropyl-6-fluoro-1,4-dihydro-N-methyl-4-oxoquinoline-3-carboxamide (3a)
Type:
Small organic molecule
Emp. Form.:
C20H23FN4O3
Mol. Mass.:
386.42
SMILES:
CNC(=O)c1cn(C2CC2)c2cc(N3CCN(CC3)C(C)=O)c(F)cc2c1=O
: