Target
Urease subunit alpha
Ligand
BDBM221063
Substrate
Meas. Tech.
In Vitro Urease Inhibition Assay
IC50
2.08e+3±n/a nM
Citation
 Abdullah, MAAbuo-Rahma, GEAbdelhafez, EMHassan, HAAbd El-Baky, RM Design, synthesis, molecular docking, anti-Proteus mirabilis and urease inhibition of new fluoroquinolone carboxylic acid derivatives. Bioorg Chem 70:1-11 (2017)  
Target
Name:
Urease subunit alpha
Synonyms:
URE23_HELPY hpuA | ureA
Type:
Enzyme
Mol. Mass.:
26545.30
Organism:
Helicobacter pylori
Description:
P14916
Residue:
238
  
Inhibitor
Name:
BDBM221063
Synonyms:
7-(4-(3,4,5-Trimethoxy piperazin-1-yl))-1-cyclopropyl-6-fluoro-1,4-dihydro-4-oxoquinoline-3-carbohydrazide (5c)
Type:
Small organic molecule
Emp. Form.:
C27H30FN5O6
Mol. Mass.:
539.5554
SMILES:
COc1cc(cc(OC)c1OC)C(=O)N1CCN(CC1)c1cc2n(cc(C(=O)NN)c(=O)c2cc1F)C1CC1
: