Target
Nuclear receptor ROR-gamma [258-518,Y502F]
Ligand
BDBM221229
Substrate
Meas. Tech.
RORγt Reporter Assay
IC50
160±n/a nM
Citation
 Leonard, KABarbay, KEdwards, JPKreutter, KDKummer, DAMaharoof, UNishimura, RUrbanski, MVenkatesan, HWang, AWolin, RLWoods, CRFourie, AXue, X Heteroaryl linked quinolinyl modulators of RORγt US Patent  US9303015 Publication Date 4/5/2016 
Target
Name:
Nuclear receptor ROR-gamma [258-518,Y502F]
Synonyms:
NR1F3 RORG RZRG | Retinoic acid-related nuclear receptor gamma t (RORgammat)
Type:
Enzyme
Mol. Mass.:
30130.98
Organism:
Homo sapiens (Human)
Description:
Artificial LBD sequence mutated AF2 domain (Seq No: 9)
Residue:
261
  
Inhibitor
Name:
BDBM221229
Synonyms:
US9303015, 3a US9303015, 3c
Type:
Small organic molecule
Emp. Form.:
C30H28Cl2N4O2
Mol. Mass.:
547.475
SMILES:
CCN(CC)c1nc2ccc(cc2c(Cl)c1Oc1ccccc1)C(O)(c1cncn1C)c1ccc(Cl)cc1
: