Target
Nuclear receptor ROR-gamma [258-518,Y502F]
Ligand
BDBM221236
Substrate
Meas. Tech.
RORγt Reporter Assay
IC50
87±n/a nM
Citation
 Leonard, KABarbay, KEdwards, JPKreutter, KDKummer, DAMaharoof, UNishimura, RUrbanski, MVenkatesan, HWang, AWolin, RLWoods, CRFourie, AXue, X Heteroaryl linked quinolinyl modulators of RORγt US Patent  US9303015 Publication Date 4/5/2016 
Target
Name:
Nuclear receptor ROR-gamma [258-518,Y502F]
Synonyms:
NR1F3 RORG RZRG | Retinoic acid-related nuclear receptor gamma t (RORgammat)
Type:
Enzyme
Mol. Mass.:
30130.98
Organism:
Homo sapiens (Human)
Description:
Artificial LBD sequence mutated AF2 domain (Seq No: 9)
Residue:
261
  
Inhibitor
Name:
BDBM221236
Synonyms:
US9303015, 10a US9303015, 10c
Type:
Small organic molecule
Emp. Form.:
C28H25ClN4O4
Mol. Mass.:
516.976
SMILES:
CCOc1nc2ccc(cc2c(Cl)c1Oc1ccccc1)C(O)(c1cncn1C)c1ccc(OC)nc1
: