Target
Nuclear receptor ROR-gamma [258-518,Y502F]
Ligand
BDBM221253
Substrate
Meas. Tech.
RORγt Reporter Assay
IC50
95±n/a nM
Citation
 Leonard, KABarbay, KEdwards, JPKreutter, KDKummer, DAMaharoof, UNishimura, RUrbanski, MVenkatesan, HWang, AWolin, RLWoods, CRFourie, AXue, X Heteroaryl linked quinolinyl modulators of RORγt US Patent  US9303015 Publication Date 4/5/2016 
Target
Name:
Nuclear receptor ROR-gamma [258-518,Y502F]
Synonyms:
NR1F3 RORG RZRG | Retinoic acid-related nuclear receptor gamma t (RORgammat)
Type:
Enzyme
Mol. Mass.:
30130.98
Organism:
Homo sapiens (Human)
Description:
Artificial LBD sequence mutated AF2 domain (Seq No: 9)
Residue:
261
  
Inhibitor
Name:
BDBM221253
Synonyms:
US9303015, 27a US9303015, 27c
Type:
Small organic molecule
Emp. Form.:
C31H26ClF6N5O2
Mol. Mass.:
650.014
SMILES:
CCN(CC)c1nc2ccc(cc2c(c1Oc1ccc(Cl)cc1)C(F)(F)F)C(O)(c1cncn1C)c1ccc(nc1)C(F)(F)F
: