Target
Nuclear receptor ROR-gamma [258-518,Y502F]
Ligand
BDBM221261
Substrate
Meas. Tech.
RORγt Reporter Assay
IC50
100±n/a nM
Citation
 Leonard, KABarbay, KEdwards, JPKreutter, KDKummer, DAMaharoof, UNishimura, RUrbanski, MVenkatesan, HWang, AWolin, RLWoods, CRFourie, AXue, X Heteroaryl linked quinolinyl modulators of RORγt US Patent  US9303015 Publication Date 4/5/2016 
Target
Name:
Nuclear receptor ROR-gamma [258-518,Y502F]
Synonyms:
NR1F3 RORG RZRG | Retinoic acid-related nuclear receptor gamma t (RORgammat)
Type:
Enzyme
Mol. Mass.:
30130.98
Organism:
Homo sapiens (Human)
Description:
Artificial LBD sequence mutated AF2 domain (Seq No: 9)
Residue:
261
  
Inhibitor
Name:
BDBM221261
Synonyms:
US9303015, 35
Type:
Small organic molecule
Emp. Form.:
C28H20Cl3N3O
Mol. Mass.:
520.837
SMILES:
CN(c1ccccc1)c1c(Cl)nc2ccc(cc2c1Cl)C(O)(c1cccnc1)c1cccc(Cl)c1
: