Target
Neuronal acetylcholine receptor subunit alpha-7
Ligand
BDBM50428083
Substrate
Meas. Tech.
[3H]-Epibatidine Radioligand Binding Assay
pH
7.4±n/a
Temperature
277.15±n/a K
Ki
81000±n/a nM
Comments
extracted
Citation
 Xiao, YKellar, KJBrown, MLPaige, MALiu, YLevin, EDRezvani, AH 2,5-disubstituted-pyridyl nicotinic ligands, and methods of use thereof US Patent  US9303017 Publication Date 4/5/2016 
Target
Name:
Neuronal acetylcholine receptor subunit alpha-7
Synonyms:
ACHA7_RAT Cholinergic, Nicotinic Alpha7 Chrna7 Neuronal acetylcholine receptor (alpha7 nAChR) Neuronal acetylcholine receptor subunit alpha-7 Neuronal acetylcholine receptor subunit alpha-7 (nAChR)
Type:
Enzyme
Mol. Mass.:
56502.44
Organism:
Rattus norvegicus (Rat)
Description:
Q05941
Residue:
502
  
Inhibitor
Name:
BDBM50428083
Synonyms:
CHEMBL2323568 | US9303017, (S)-16, YL-1-169
Type:
Small organic molecule
Emp. Form.:
C17H24N2O
Mol. Mass.:
272.3853
SMILES:
CCCCC#Cc1cnc(C)c(OC[C@@H]2CCCN2)c1
: