Target
Beta-2 adrenergic receptor
Ligand
BDBM221901
Substrate
Meas. Tech.
Adrenergic Receptor Binding Assay
Temperature
298.15±n/a K
IC50
6.7±n/a nM
Comments
extracted
Citation
 Prat Quinones, MFonquerna Pou, SPuig Duran, CLumeras Amador, WAiguade Bosch, JCaturla Jovaloyes, JF Cyclohexylamine derivatives having β2 adrenergic agonist and M3 muscarinic antagonist activities US Patent  US9315463 Publication Date 4/19/2016 
Target
Name:
Beta-2 adrenergic receptor
Synonyms:
ADRB2 ADRB2_HUMAN Beta-2 adrenoceptor | Beta-2 adrenoreceptor
Type:
Mol. Mass.:
46461.69
Organism:
Homo sapiens (Human)
Description:
P07550
Residue:
413
  
Inhibitor
Name:
BDBM221901
Synonyms:
US9315463, 10
Type:
Small organic molecule
Emp. Form.:
C38H41ClN4O7S2
Mol. Mass.:
765.338
SMILES:
CN(CCC(=O)Nc1ccc(CNC[C@H](O)c2ccc(O)c3[nH]c(=O)ccc23)cc1Cl)[C@H]1CC[C@@H](CC1)OC(=O)C(O)(c1cccs1)c1cccs1
: