Target
Beta-2 adrenergic receptor
Ligand
BDBM221908
Substrate
Meas. Tech.
Adrenergic Receptor Binding Assay
Temperature
298.15±n/a K
IC50
4.5±n/a nM
Comments
extracted
Citation
 Prat Quinones, MFonquerna Pou, SPuig Duran, CLumeras Amador, WAiguade Bosch, JCaturla Jovaloyes, JF Cyclohexylamine derivatives having β2 adrenergic agonist and M3 muscarinic antagonist activities US Patent  US9315463 Publication Date 4/19/2016 
Target
Name:
Beta-2 adrenergic receptor
Synonyms:
ADRB2 ADRB2_HUMAN Beta-2 adrenoceptor | Beta-2 adrenoreceptor
Type:
Mol. Mass.:
46461.69
Organism:
Homo sapiens (Human)
Description:
P07550
Residue:
413
  
Inhibitor
Name:
BDBM221908
Synonyms:
US9315463, 22
Type:
Small organic molecule
Emp. Form.:
C40H43N5O9S2
Mol. Mass.:
801.928
SMILES:
COc1cc(NC(=O)OCCN(C)[C@H]2CC[C@@H](CC2)OC(=O)C(O)(c2cccs2)c2cccs2)c(cc1CNC[C@H](O)c1ccc(O)c2[nH]c(=O)ccc12)C#N
: