Target
Muscarinic acetylcholine receptor M3
Ligand
BDBM221899
Substrate
Meas. Tech.
Muscarinic Receptor Binding Assay
IC50
1.3±n/a nM
Citation
 Prat Quinones, MFonquerna Pou, SPuig Duran, CLumeras Amador, WAiguade Bosch, JCaturla Jovaloyes, JF Cyclohexylamine derivatives having β2 adrenergic agonist and M3 muscarinic antagonist activities US Patent  US9315463 Publication Date 4/19/2016 
Target
Name:
Muscarinic acetylcholine receptor M3
Synonyms:
ACM3_HUMAN Cholinergic, muscarinic M3 Muscarinic receptor M3 | RecName: Full=Muscarinic acetylcholine receptor M3
Type:
Enzyme
Mol. Mass.:
66151.03
Organism:
Homo sapiens (Human)
Description:
P20309
Residue:
590
  
Inhibitor
Name:
BDBM221899
Synonyms:
US9315463, 2
Type:
Small organic molecule
Emp. Form.:
C38H43N3O7S2
Mol. Mass.:
717.894
SMILES:
CN(CCOc1ccc(CCNC[C@H](O)c2ccc(O)c3[nH]c(=O)ccc23)cc1)C1CC[C@@H](CC1)OC(=O)C(O)(c1cccs1)c1cccs1
: