Target
Epidermal/Hepatocyte growth factor receptor
Ligand
BDBM222077
Substrate
Meas. Tech.
In Vitro c-Met Enzyme Assay
IC50
1.557e+4± 3.1e+2 nM
Citation
 Yang, YZhang, YYang, LZhao, LSi, LZhang, HLiu, QZhou, J Discovery of imidazopyridine derivatives as novel c-Met kinase inhibitors: Synthesis, SAR study, and biological activity. Bioorg Chem 70:126-132 (2017)  
Target
Name:
Epidermal/Hepatocyte growth factor receptor
Synonyms:
c-Met/EGFR
Type:
Protein
Mol. Mass.:
Description:
Components:
This complex has 2 components.
Component 1
Name:
Hepatocyte growth factor receptor
Synonyms:
Hepatocyte growth factor receptor Hepatocyte growth factor receptor (c-MET) MET Met proto-oncogene (hepatocyte growth factor receptor) Tyrosine-protein kinase Met (c-Met) c-Met kinase
Type:
Protein
Mol. Mass.:
155559.73
Organism:
Homo sapiens (Human)
Description:
P08581
Residue:
1390
  
Component 2
Name:
Epidermal growth factor receptor
Synonyms:
EGF Receptor Substrate EGFR_HUMAN ERBB1 Epidermal Growth Factor Receptor erbB-1 Epidermal growth factor receptor (EGFR) HER1 Proto-oncogene c-ErbB-1 Tyrosine-Protein Kinase ErbB-1
Type:
Receptor Kinase Domain
Mol. Mass.:
134279.59
Organism:
Homo sapiens (Human)
Description:
P00533
Residue:
1210
  
Inhibitor
Name:
BDBM222077
Synonyms:
6-chloro-3-((2-(2,5-dichlorophenyl)imidazo[1,2-a]pyridin-8-yl)methoxy)-[1,2,4]triazolo[4,3-b] pyridazine (7e)
Type:
Small organic molecule
Emp. Form.:
C19H11Cl3N6O
Mol. Mass.:
445.689
SMILES:
Clc1ccc(Cl)c(c1)-c1cn2cccc(COc3nnc4ccc(Cl)nn34)c2n1
: