Target
5'-nucleotidase
Ligand
BDBM222259
Substrate
Meas. Tech.
Ecto-5'-Nucleotidase Inhibition Assay
pH
7.4±n/a
Temperature
310.15±n/a K
IC50
2.85e+3± 1.5e+2 nM
Comments
extracted
Citation
 Ejaz, SASaeed, ASiddique, MNNisa, ZUKhan, SLecka, JSévigny, JIqbal, J Synthesis, characterization and biological evaluation of novel chalcone sulfonamide hybrids as potent intestinal alkaline phosphatase inhibitors. Bioorg Chem 70:229-236 (2017)  
Target
Name:
5'-nucleotidase
Synonyms:
5'-nucleotidase Ecto-5'-nucleotidase (e5'NT) NT Nt5e | Nte
Type:
Enzyme
Mol. Mass.:
63971.44
Organism:
Rattus norvegicus (Rat)
Description:
P21588
Residue:
576
  
Inhibitor
Name:
BDBM222259
Synonyms:
(Z)-4-(2-((E)-4-(2,4-dichlorophenyl)-1-morpholino-2-oxobut-3-enylidene)hydrazinyl) benzenesulfonamide (4b)
Type:
Small organic molecule
Emp. Form.:
C20H20Cl2N4O4S
Mol. Mass.:
483.368
SMILES:
NS(=O)(=O)c1ccc(N\N=C(/N2CCOCC2)C(=O)\C=C\c2ccc(Cl)cc2Cl)cc1
: