Target
5'-nucleotidase
Ligand
BDBM222263
Substrate
Meas. Tech.
Ecto-5'-Nucleotidase Inhibition Assay
pH
7.4±n/a
Temperature
310.15±n/a K
IC50
6.8e+2± 2e+1 nM
Comments
extracted
Citation
 Ejaz, SASaeed, ASiddique, MNNisa, ZUKhan, SLecka, JSévigny, JIqbal, J Synthesis, characterization and biological evaluation of novel chalcone sulfonamide hybrids as potent intestinal alkaline phosphatase inhibitors. Bioorg Chem 70:229-236 (2017)  
Target
Name:
5'-nucleotidase
Synonyms:
5'-nucleotidase Ecto-5'-nucleotidase (e5'NT) NT Nt5e | Nte
Type:
Enzyme
Mol. Mass.:
63971.44
Organism:
Rattus norvegicus (Rat)
Description:
P21588
Residue:
576
  
Inhibitor
Name:
BDBM222263
Synonyms:
(Z)-4-(2-((E)-1-morpholino-2-oxo-4-(3,4,5-Trimethoxyphenyl)but-3-enylidene) hydrazinyl)benzenesulfonamide (4f)
Type:
Small organic molecule
Emp. Form.:
C23H28N4O7S
Mol. Mass.:
504.556
SMILES:
COc1cc(\C=C\C(=O)C(=N\Nc2ccc(cc2)S(N)(=O)=O)\N2CCOCC2)cc(OC)c1OC
: