Target
Cytochrome P450 144 [31-434]
Ligand
BDBM7886
Substrate
Meas. Tech.
Optical Titration Assay
pH
7±n/a
Kd
2.90e+5± 7.4e+4 nM
Comments
extracted
Citation
 Kavanagh, MEChenge, JZoufir, AMcLean, KJCoyne, AGBender, AMunro, AWAbell, C Fragment Profiling Approach to Inhibitors of the Orphan M. tuberculosis P450 CYP144A1. Biochemistry 56:1559-1572 (2017)  
Target
Name:
Cytochrome P450 144 [31-434]
Synonyms:
CP144_MYCTO cyp144
Type:
Protein
Mol. Mass.:
43963.64
Organism:
Mycobacterium tuberculosis
Description:
M. tuberculosis cytochrome P450 144 truncation (31-434 aa)
Residue:
404
  
Inhibitor
Name:
BDBM7886
Synonyms:
1-PIM 1-phenylimidazole US9138393, 1-Phenyl- imidazole | US9144538, 1-Phenylimidazole
Type:
Small organic molecule
Emp. Form.:
C9H8N2
Mol. Mass.:
144.1732
SMILES:
c1cn(cn1)-c1ccccc1
: