Target
Dipeptidyl peptidase 3
Ligand
BDBM19459
Substrate
Meas. Tech.
DPP III Enzyme Activity Assay
pH
7.4±0
Temperature
310.15±0 K
IC50
3.66e+4± 4e+3 nM
Citation
 Agic, DBrkic, HTomic, SKaracic, Z?poljarevic, MLisjak, MBe?lo, DAbramic, M Validation of flavonoids as potential dipeptidyl peptidase III inhibitors: Experimental and computational approach. Chem Biol Drug Des 89:619-627 (2017)  
Target
Name:
Dipeptidyl peptidase 3
Synonyms:
DPP3 Dipeptidyl arylamidase III Dipeptidyl peptidase III | Dipeptidyl peptidase III (DPP III)
Type:
Enzyme
Mol. Mass.:
82565.94
Organism:
Homo sapiens (Human)
Description:
Q9NY33
Residue:
737
  
Inhibitor
Name:
BDBM19459
Synonyms:
5,7-dihydroxy-3-(4-hydroxyphenyl)-4H-chromen-4-one Genistein Genisteol US8552057, 2 | cid_5280961
Type:
Phytoestrogen
Emp. Form.:
C15H10O5
Mol. Mass.:
270.2369
SMILES:
Oc1ccc(cc1)-c1coc2cc(O)cc(O)c2c1=O
: