Target
Dipeptidyl peptidase 3
Ligand
BDBM7460
Substrate
Meas. Tech.
DPP III Enzyme Activity Assay
pH
7.4±0
Temperature
310.15±0 K
IC50
7.41e+4± 6e+3 nM
Citation
 Agic, DBrkic, HTomic, SKaracic, Z?poljarevic, MLisjak, MBe?lo, DAbramic, M Validation of flavonoids as potential dipeptidyl peptidase III inhibitors: Experimental and computational approach. Chem Biol Drug Des 89:619-627 (2017)  
Target
Name:
Dipeptidyl peptidase 3
Synonyms:
DPP3 Dipeptidyl arylamidase III Dipeptidyl peptidase III | Dipeptidyl peptidase III (DPP III)
Type:
Enzyme
Mol. Mass.:
82565.94
Organism:
Homo sapiens (Human)
Description:
Q9NY33
Residue:
737
  
Inhibitor
Name:
BDBM7460
Synonyms:
2-(3,4-dihydroxyphenyl)-3,5,7-trihydroxy-4H-chromen-4-one 2-(3,4-dihydroxyphenyl)-3,5,7-trihydroxy-chromone;hydrate Quercetin Quercetin (21) US11021454, Compound Quercetin med.21724, Compound 4
Type:
Small organic molecule
Emp. Form.:
C15H10O7
Mol. Mass.:
302.2357
SMILES:
Oc1cc(O)c2c(c1)oc(-c1ccc(O)c(O)c1)c(O)c2=O
: