Target
Dipeptidyl peptidase 3
Ligand
BDBM7461
Substrate
Meas. Tech.
DPP III Enzyme Activity Assay
pH
7.4±0
Temperature
310.15±0 K
IC50
1.231e+5± 1.0e+4 nM
Citation
 Agic, DBrkic, HTomic, SKaracic, Z?poljarevic, MLisjak, MBe?lo, DAbramic, M Validation of flavonoids as potential dipeptidyl peptidase III inhibitors: Experimental and computational approach. Chem Biol Drug Des 89:619-627 (2017)  
Target
Name:
Dipeptidyl peptidase 3
Synonyms:
DPP3 Dipeptidyl arylamidase III Dipeptidyl peptidase III | Dipeptidyl peptidase III (DPP III)
Type:
Enzyme
Mol. Mass.:
82565.94
Organism:
Homo sapiens (Human)
Description:
Q9NY33
Residue:
737
  
Inhibitor
Name:
BDBM7461
Synonyms:
5,7-dihydroxy-2-phenyl-4H-chromen-4-one 5,7-dihydroxyflavone chrysin | cid_5281607
Type:
Small organic molecule
Emp. Form.:
C15H10O4
Mol. Mass.:
254.2375
SMILES:
Oc1cc(O)c2c(c1)oc(cc2=O)-c1ccccc1
: