Target
Tyrosine-protein phosphatase non-receptor type 1 [1-322]
Ligand
BDBM223199
Substrate
Meas. Tech.
PTP1B Activity Assay
pH
7±0
Ki
3.85e+4±n/a nM
IC50
7.7e+4± 9e+3 nM
Citation
 Punthasee, PLaciak, ARCummings, AHRuddraraju, KVLewis, SMHillebrand, RSingh, HTanner, JJGates, KS Covalent Allosteric Inactivation of Protein Tyrosine Phosphatase 1B (PTP1B) by an Inhibitor-Electrophile Conjugate. Biochemistry 56:2051-2060 (2017)  
Target
Name:
Tyrosine-protein phosphatase non-receptor type 1 [1-322]
Synonyms:
PTN1_HUMAN PTPN1 | Protein tyrosine phosphatase 1B (PTP1B)
Type:
Enzyme
Mol. Mass.:
37368.76
Organism:
Homo sapiens (Human)
Description:
Human PTP1B truncation (1-322 aa)
Residue:
322
  
Inhibitor
Name:
BDBM223199
Synonyms:
5-(4-Methyl[1,1'-biphenyl]-3-yl)-1,2,5-thiadiazolidin-3-one 1,1-Dioxide (2b)
Type:
Small organic molecule
Emp. Form.:
C15H14N2O3S
Mol. Mass.:
302.348
SMILES:
Cc1ccc(cc1N1CC(=O)NS1(=O)=O)-c1ccccc1
: