Target
Tyrosine-protein kinase SYK
Ligand
BDBM50400047
Substrate
Meas. Tech.
In Vitro Assay
pH
7.5±n/a
Temperature
298.15±n/a K
IC50
5.5±n/a nM
Comments
extracted
Citation
 Jia, ZJVenkataramani, CHuang, WMehrotra, MSong, YXu, QBauer, SMRose, JWKane, BPandey, A Inhibitors of syk and JAK protein kinases US Patent  US9579320 Publication Date 2/28/2017 
Target
Name:
Tyrosine-protein kinase SYK
Synonyms:
KSYK_HUMAN Spleen Tyrosine Kinase Tyrosine-protein kinase SYK (Syk)
Type:
Enzyme
Mol. Mass.:
72079.99
Organism:
Homo sapiens (Human)
Description:
P43405
Residue:
635
  
Inhibitor
Name:
BDBM50400047
Synonyms:
BIIB-057 US9579320, Example 87
Type:
Small organic molecule
Emp. Form.:
C19H23N9O
Mol. Mass.:
393.4456
SMILES:
N[C@H]1CCCC[C@H]1Nc1ncc(C(N)=O)c(Nc2cccc(c2)-n2nccn2)n1
: