Target
Tyrosine-protein kinase SYK
Ligand
BDBM290737
Substrate
Meas. Tech.
In Vitro Assay
pH
7.5±n/a
Temperature
298.15±n/a K
IC50
5.5±n/a nM
Comments
extracted
Citation
 Jia, ZJVenkataramani, CHuang, WMehrotra, MSong, YXu, QBauer, SMRose, JWKane, BPandey, A Inhibitors of syk and JAK protein kinases US Patent  US9579320 Publication Date 2/28/2017 
Target
Name:
Tyrosine-protein kinase SYK
Synonyms:
KSYK_HUMAN Spleen Tyrosine Kinase Tyrosine-protein kinase SYK (Syk)
Type:
Enzyme
Mol. Mass.:
72079.99
Organism:
Homo sapiens (Human)
Description:
P43405
Residue:
635
  
Inhibitor
Name:
BDBM290737
Synonyms:
4-(1H-indol-6-ylamino)-2-((1R,2S)-2-aminocyclohexylamino)pyrimidine-5-carboxamide 6 | US9579320, Example 130
Type:
Small organic molecule
Emp. Form.:
C19H23N7O
Mol. Mass.:
365.4322
SMILES:
N[C@H]1CCCC[C@H]1Nc1ncc(C(N)=O)c(Nc2ccc3cc[nH]c3c2)n1
: