Target
Tyrosine-protein kinase SYK
Ligand
BDBM290851
Substrate
Meas. Tech.
In Vitro Assay
pH
7.5±n/a
Temperature
298.15±n/a K
IC50
5.5±n/a nM
Comments
extracted
Citation
 Jia, ZJVenkataramani, CHuang, WMehrotra, MSong, YXu, QBauer, SMRose, JWKane, BPandey, A Inhibitors of syk and JAK protein kinases US Patent  US9579320 Publication Date 2/28/2017 
Target
Name:
Tyrosine-protein kinase SYK
Synonyms:
KSYK_HUMAN Spleen Tyrosine Kinase Tyrosine-protein kinase SYK (Syk)
Type:
Enzyme
Mol. Mass.:
72079.99
Organism:
Homo sapiens (Human)
Description:
P43405
Residue:
635
  
Inhibitor
Name:
BDBM290851
Synonyms:
2-((1R,2S)-2-aminocyclohexylamino)-4-(3-(benzo[d][1,3]dioxol-5-yl)phenylamino)pyrimidine-5-carboxamide | US9579320, Example 253
Type:
Small organic molecule
Emp. Form.:
C24H26N6O3
Mol. Mass.:
446.5016
SMILES:
N[C@H]1CCCC[C@H]1Nc1ncc(C(N)=O)c(Nc2cccc(c2)-c2ccc3OCOc3c2)n1
: