Target
Lysine-specific demethylase 5D
Ligand
BDBM191598
Substrate
Meas. Tech.
AlphaScreen Assay
IC50
2e+1±3.2 nM
Citation
 Tumber, ANuzzi, AHookway, ESHatch, SBVelupillai, SJohansson, CKawamura, ASavitsky, PYapp, CSzykowska, AWu, NBountra, CStrain-Damerell, CBurgess-Brown, NARuda, GFFedorov, OMunro, SEngland, KSNowak, RPSchofield, CJLa Thangue, NBPawlyn, CDavies, FMorgan, GAthanasou, NMüller, SOppermann, UBrennan, PE Potent and Selective KDM5 Inhibitor Stops Cellular Demethylation of H3K4me3 at Transcription Start Sites and Proliferation of MM1S Myeloma Cells. Cell Chem Biol 24:371-380 (2017)  
Target
Name:
Lysine-specific demethylase 5D
Synonyms:
HY JARID1D KDM5D_HUMAN Lysine-specific demethylase 5D (KDM5D) | SMCY
Type:
Enzyme
Mol. Mass.:
174050.91
Organism:
Homo sapiens (Human)
Description:
Q9BY66
Residue:
1539
  
Inhibitor
Name:
BDBM191598
Synonyms:
2-(((2-((2-(dimethylamino)ethyl)(ethyl)amino)-2-oxoethyl)amino)methyl)isonicotinic acid (KDM5-C49) KDOAM-20
Type:
Small organic molecule
Emp. Form.:
C15H24N4O3
Mol. Mass.:
308.3761
SMILES:
CCN(CCN(C)C)C(=O)CNCc1cc(ccn1)C(O)=O
: