Target
Lysine-specific demethylase 4A
Ligand
BDBM191598
Substrate
Meas. Tech.
AlphaScreen Assay
IC50
6e+2±1.4e+2 nM
Citation
 Tumber, ANuzzi, AHookway, ESHatch, SBVelupillai, SJohansson, CKawamura, ASavitsky, PYapp, CSzykowska, AWu, NBountra, CStrain-Damerell, CBurgess-Brown, NARuda, GFFedorov, OMunro, SEngland, KSNowak, RPSchofield, CJLa Thangue, NBPawlyn, CDavies, FMorgan, GAthanasou, NMüller, SOppermann, UBrennan, PE Potent and Selective KDM5 Inhibitor Stops Cellular Demethylation of H3K4me3 at Transcription Start Sites and Proliferation of MM1S Myeloma Cells. Cell Chem Biol 24:371-380 (2017)  
Target
Name:
Lysine-specific demethylase 4A
Synonyms:
JHDM3A JMJD2A Jumonji domain-containing protein 2A KDM4A_HUMAN Lysine-specific demethylase 4A | Lysine-specific demethylase 4A (KDM4A)
Type:
Enzyme
Mol. Mass.:
120647.83
Organism:
Homo sapiens (Human)
Description:
O75164
Residue:
1064
  
Inhibitor
Name:
BDBM191598
Synonyms:
2-(((2-((2-(dimethylamino)ethyl)(ethyl)amino)-2-oxoethyl)amino)methyl)isonicotinic acid (KDM5-C49) KDOAM-20
Type:
Small organic molecule
Emp. Form.:
C15H24N4O3
Mol. Mass.:
308.3761
SMILES:
CCN(CCN(C)C)C(=O)CNCc1cc(ccn1)C(O)=O
: