Target
Insulin receptor substrate 1 [1-264]
Ligand
BDBM223477
Substrate
Meas. Tech.
Silico Screening Assay
Kd
1990±n/a nM
Citation
 Mahadevan, DMeuillet, EJMash, Jr., EAGokhale, VMPowis, GZhang, S Small molecule inhibitors of the pleckstrin homology domain and methods for using same US Patent  US9320734 Publication Date 4/26/2016 
Target
Name:
Insulin receptor substrate 1 [1-264]
Synonyms:
IRS1 Insulin receptor substrate 1 (IRS1)
Type:
Enzyme
Mol. Mass.:
28998.05
Organism:
Homo sapiens (Human)
Description:
PLECKSTRIN HOMOLOGY DOMAIN, RESIDUES 1-264 (PH domain)
Residue:
264
  
Inhibitor
Name:
BDBM223477
Synonyms:
US9320734, 316
Type:
Small organic molecule
Emp. Form.:
C21H16ClN7O4S
Mol. Mass.:
497.914
SMILES:
CC1=NN(C(=O)c2ccc(Cl)cc2)C(=O)C1\N=N\c1ccc(cc1)S(=O)(=O)Nc1ncccn1
: