Target
3-phosphoinositide-dependent protein kinase 1 [409-556]
Ligand
BDBM223477
Substrate
Meas. Tech.
Silico Screening Assay
Kd
31280±9540 nM
Citation
 Mahadevan, DMeuillet, EJMash, Jr., EAGokhale, VMPowis, GZhang, S Small molecule inhibitors of the pleckstrin homology domain and methods for using same US Patent  US9320734 Publication Date 4/26/2016 
Target
Name:
3-phosphoinositide-dependent protein kinase 1 [409-556]
Synonyms:
3-phosphoinositide-dependent protein kinase 1 (PDK1) PDPK1 | PDPK1_HUMAN
Type:
Enzyme
Mol. Mass.:
17526.67
Organism:
Homo sapiens (Human)
Description:
PLECKSTRIN HOMOLOGY DOMAIN, RESIDUES 409-556 (PH domain)
Residue:
148
  
Inhibitor
Name:
BDBM223477
Synonyms:
US9320734, 316
Type:
Small organic molecule
Emp. Form.:
C21H16ClN7O4S
Mol. Mass.:
497.914
SMILES:
CC1=NN(C(=O)c2ccc(Cl)cc2)C(=O)C1\N=N\c1ccc(cc1)S(=O)(=O)Nc1ncccn1
: