Target
C-X-C chemokine receptor type 1
Ligand
BDBM236788
Substrate
Meas. Tech.
In Vitro Affinity Assay
IC50
42.0±n/a nM
Citation
 Musicki, BAubert, JBoiteau, JClary, LRossio, PSchuppli-Nollet, M Disubstituted 3,4-diamino-3-cyclobutene-1,2-dione compounds for use in the treatment of chemokine-mediated diseases US Patent  US9580412 Publication Date 2/28/2017 
Target
Name:
C-X-C chemokine receptor type 1
Synonyms:
C-X-C chemokine receptor type 1 (CXCR-1) CMKAR1 CXCR1_HUMAN Interleukin-8 receptor A | Interleukin-8 receptors, CXCR1/CXCR2
Type:
Enzyme
Mol. Mass.:
39803.83
Organism:
Homo sapiens (Human)
Description:
P25024
Residue:
350
  
Inhibitor
Name:
BDBM236788
Synonyms:
US9388149, 19 | US9580412, Example 19
Type:
Small organic molecule
Emp. Form.:
C25H27N3O7S
Mol. Mass.:
513.563
SMILES:
COC(=O)CN(C)C(=O)c1cccc(Nc2c(N[C@H](C3CCCS3)c3ccc(C)o3)c(=O)c2=O)c1O
: