Target
Dehaloperoxidase B
Ligand
BDBM7882
Substrate
Meas. Tech.
Resonance Raman Assay
pH
7±0
Kd
5.2e+4± 2e+3 nM
Citation
 McCombs, NLMoreno-Chicano, TCarey, LMFranzen, SHough, MAGhiladi, RA Interaction of Azole-Based Environmental Pollutants with the Coelomic Hemoglobin from Amphitrite ornata: A Molecular Basis for Toxicity. Biochemistry 56:2294-2303 (2017)  
Target
Name:
Dehaloperoxidase B
Synonyms:
Dehaloperoxidase B (DHP B)
Type:
Enzyme
Mol. Mass.:
15527.51
Organism:
Amphitrite ornata
Description:
Q9NAV7
Residue:
138
  
Inhibitor
Name:
BDBM7882
Synonyms:
1H-imidazole Imidazole (Im) US9144538, Imidazole | imidazole
Type:
Small organic molecule
Emp. Form.:
C3H4N2
Mol. Mass.:
68.0773
SMILES:
c1c[nH]cn1
: