Target
Cyclin-dependent kinase 2
Ligand
BDBM225312
Substrate
Meas. Tech.
OctetRed_Method2
Kd
5400±3090 nM
Citation
 D3R, DD CSAR CDK2-CyclinA D3R 219:0 (2015) Target
Name:
Cyclin-dependent kinase 2
Synonyms:
CDK2 CDK2_HUMAN Cell division protein kinase 2 Protein cereblon/Cyclin-dependent kinase 2 | p33 protein kinase
Type:
Enzyme Subunit
Mol. Mass.:
33938.17
Organism:
Homo sapiens (Human)
Description:
P24941
Residue:
298
  
Inhibitor
Name:
BDBM225312
Synonyms:
CS4
Type:
Small Organic Molecule
Emp. Form.:
C14H12N3O3
Mol. Mass.:
270.2639
SMILES:
[O-]C(=O)c1ccc(cc1)C(=O)Nc1cc([nH]n1)C1CC1
: