Target
Cyclin-dependent kinase 2
Ligand
BDBM91761
Substrate
Meas. Tech.
OctetRed_Method2
Kd
61.7±12.2 nM
Citation
 D3R, DD CSAR CDK2-CyclinA D3R 219:0 (2015) Target
Name:
Cyclin-dependent kinase 2
Synonyms:
CDK2 CDK2_HUMAN Cell division protein kinase 2 Protein cereblon/Cyclin-dependent kinase 2 | p33 protein kinase
Type:
Enzyme Subunit
Mol. Mass.:
33938.17
Organism:
Homo sapiens (Human)
Description:
P24941
Residue:
298
  
Inhibitor
Name:
BDBM91761
Synonyms:
CS19
Type:
Emp. Form.:
C17H18N6O2S
Mol. Mass.:
370.429
SMILES:
CN(C)c1ccc(Nc2nccc(n2)-c2sc(C)nc2C)cc1[N+]([O-])=O
: