Target
Cyclin-dependent kinase 2
Ligand
BDBM91787
Substrate
Meas. Tech.
OctetRed_Method1
Kd
>100000±n/a nM
Citation
 D3R, DD CSAR CDK2-CyclinA D3R 219:0 (2015) Target
Name:
Cyclin-dependent kinase 2
Synonyms:
CDK2 CDK2_HUMAN Cell division protein kinase 2 Protein cereblon/Cyclin-dependent kinase 2 | p33 protein kinase
Type:
Enzyme Subunit
Mol. Mass.:
33938.17
Organism:
Homo sapiens (Human)
Description:
P24941
Residue:
298
  
Inhibitor
Name:
BDBM91787
Synonyms:
CS33
Type:
Emp. Form.:
C13H13BrN2O2S2
Mol. Mass.:
373.289
SMILES:
Brc1ccc(cc1)S(=O)(=O)NCCSc1ccccn1
: