Target
Cyclin-dependent kinase 2
Ligand
BDBM91796
Substrate
Meas. Tech.
OctetRed_Method1
Kd
>100000±n/a nM
Citation
 D3R, DD CSAR CDK2-CyclinA D3R 219:0 (2015) Target
Name:
Cyclin-dependent kinase 2
Synonyms:
CDK2 CDK2_HUMAN Cell division protein kinase 2 Protein cereblon/Cyclin-dependent kinase 2 | p33 protein kinase
Type:
Enzyme Subunit
Mol. Mass.:
33938.17
Organism:
Homo sapiens (Human)
Description:
P24941
Residue:
298
  
Inhibitor
Name:
BDBM91796
Synonyms:
CS49
Type:
Emp. Form.:
C22H22N4O3S2
Mol. Mass.:
454.565
SMILES:
CCOc1ccc2nc(SCC(=O)Nc3c(C)n(C)n(-c4ccccc4)c3=O)sc2c1
: