Target
Cyclin-dependent kinase 2
Ligand
BDBM8069
Substrate
Meas. Tech.
OctetRed_Method1
Kd
961±230 nM
Citation
 D3R, DD CSAR CDK2 Kinase D3R 220:0 (2015) Target
Name:
Cyclin-dependent kinase 2
Synonyms:
CDK2 CDK2_HUMAN Cell division protein kinase 2 Protein cereblon/Cyclin-dependent kinase 2 | p33 protein kinase
Type:
Enzyme Subunit
Mol. Mass.:
33938.17
Organism:
Homo sapiens (Human)
Description:
P24941
Residue:
298
  
Inhibitor
Name:
BDBM8069
Synonyms:
2-Anilino-4-(thiazol-5-yl)pyrimidine deriv. 40 CS18 | N-[4-(2-Amino-4-methyl-thiazol-5-yl)-pyrimidin-2-yl]-N, N-dimethylbenzene-1,4-diamine
Type:
Small organic molecule
Emp. Form.:
C16H18N6S
Mol. Mass.:
326.419
SMILES:
CN(C)c1ccc(Nc2nccc(n2)-c2sc(N)nc2C)cc1
: