Target
Cyclin-dependent kinase 2
Ligand
BDBM91803
Substrate
Meas. Tech.
OctetRed_Method1
Kd
>100000±n/a nM
Citation
 D3R, DD CSAR CDK2 Kinase D3R 220:0 (2015) Target
Name:
Cyclin-dependent kinase 2
Synonyms:
CDK2 CDK2_HUMAN Cell division protein kinase 2 Protein cereblon/Cyclin-dependent kinase 2 | p33 protein kinase
Type:
Enzyme Subunit
Mol. Mass.:
33938.17
Organism:
Homo sapiens (Human)
Description:
P24941
Residue:
298
  
Inhibitor
Name:
BDBM91803
Synonyms:
CS66
Type:
Emp. Form.:
C19H19N5O2S
Mol. Mass.:
381.451
SMILES:
CCn1c(SCC(=O)Nc2cccc(c2)C(C)=O)nnc1-c1ccncc1
: