Target
Malate synthase G [C619A]
Ligand
BDBM50152554
Substrate
Meas. Tech.
DNTB-Coupled_Enzyme_Assay
IC50
500±n/a nM
Citation
 D3R, DD Sacchettini GlcB D3R 223:0 (2015) Target
Name:
Malate synthase G [C619A]
Synonyms:
MASZ_MYCTO | glcB
Type:
Mol. Mass.:
80350.85
Organism:
Mycobacterium tuberculosis (strain CDC 1551 / Oshkosh)
Description:
P9WK16[C619A]
Residue:
741
  
Inhibitor
Name:
BDBM50152554
Synonyms:
4-(2-Chloro-phenyl)-2,4-dioxo-butyric acid Sacchettini_3
Type:
Small organic molecule
Emp. Form.:
C10H7ClO4
Mol. Mass.:
226.613
SMILES:
OC(=O)C(=O)CC(=O)c1ccccc1Cl
: