Target
Malate synthase G [C619A]
Ligand
BDBM225390
Substrate
Meas. Tech.
DNTB-Coupled_Enzyme_Assay
IC50
5700±n/a nM
Citation
 D3R, DD Sacchettini GlcB D3R 223:0 (2015) Target
Name:
Malate synthase G [C619A]
Synonyms:
MASZ_MYCTO | glcB
Type:
Mol. Mass.:
80350.85
Organism:
Mycobacterium tuberculosis (strain CDC 1551 / Oshkosh)
Description:
P9WK16[C619A]
Residue:
741
  
Inhibitor
Name:
BDBM225390
Synonyms:
Sacchettini_9
Type:
Small Organic Molecule
Emp. Form.:
C10H7BrO4
Mol. Mass.:
271.064
SMILES:
OC(=O)C(=O)CC(=O)c1ccc(Br)cc1
: