Target
Tyrosine-protein kinase SYK [355-635]
Ligand
BDBM225520
Substrate
Meas. Tech.
SYK assay_HTRF
IC50
1.47±n/a nM
Citation
 D3R, DD GSK SYK Kinase D3R 225:0 (2015) Target
Name:
Tyrosine-protein kinase SYK [355-635]
Synonyms:
KSYK_HUMAN SYK Kinase
Type:
Mol. Mass.:
32610.83
Organism:
Homo sapiens (Human)
Description:
P43405[355-635]
Residue:
281
  
Inhibitor
Name:
BDBM225520
Synonyms:
GTC000228A GTC000228C
Type:
Small Organic Molecule
Emp. Form.:
C22H22FN7O3S
Mol. Mass.:
483.519
SMILES:
COCCCN(c1cccc2[nH]ncc12)c1nc(Nc2ccc3CNS(=O)(=O)c3c2)ncc1F
: