Target
Tyrosine-protein kinase SYK [355-635]
Ligand
BDBM225524
Substrate
Meas. Tech.
SYK assay_HTRF
IC50
1.46±n/a nM
Citation
 D3R, DD GSK SYK Kinase D3R 225:0 (2015) Target
Name:
Tyrosine-protein kinase SYK [355-635]
Synonyms:
KSYK_HUMAN SYK Kinase
Type:
Mol. Mass.:
32610.83
Organism:
Homo sapiens (Human)
Description:
P43405[355-635]
Residue:
281
  
Inhibitor
Name:
BDBM225524
Synonyms:
GTC000230A
Type:
Small Organic Molecule
Emp. Form.:
C21H20FN7O3S
Mol. Mass.:
469.492
SMILES:
OCCCN(c1cccc2[nH]ncc12)c1nc(Nc2ccc3CNS(=O)(=O)c3c2)ncc1F
: